{"text_format":"1","workbook":"xlsx","n_sheets":9,"sheets":["Anleitung","Todesfälle mit HS","Zusammenfassung","Grundlagen","ICD-Filter","KI-Filter","FAB-Liste","EFA-Codes","DS_Beschreibung"],"not_rendered":{"charts":0,"images":12,"macros":1,"external_links":0,"defined_names":17,"comments":0,"pivot_tables":3},"unopened":[],"bounds":{"document_bytes":16777216,"sheet_cells":100000,"rows_first":2000,"rows_last":500,"rows_between":2000,"halvings":0,"cell_chars":16384,"cell_head_chars":4096},"cells_cut":0,"cells_raw":0,"read":"whole","date_system":"1900"}

{"sheet":"Anleitung","index":0,"n_rows":44,"n_cols":9,"rows_kept":44,"cut":false,"hidden":false,"merged":[[43,4,43,6]]}
[]
[]
[null,null,null,null,null,null,null,null,"Version 4.2.3"]
[]
[null,null,"Die vorliegende Datei \"TransplantCheck\" filtert alle im Krankenhaus Verstorbenen mit einer möglicherweise zum"]
[null,null,"irreversiblen Hirnfunktionsausfall (IHA) führenden akuten schweren Erkrankung oder Schädigung des Gehirns. "]
[null,null,"Das Programm ermöglicht eine Selektion der Daten Verstorbener, die nicht bereits eindeutig »ohne Beatmungs-"]
[null,null,"stunden« oder »mit absoluten Kontraindikationen« kategorisiert oder die nicht bereits an die DSO gemeldet wurden."]
[null,null,"Alle anderen erfassten Sterbefälle werden dann direkt auf dem Tabellenblatt \"Todesfälle mit HS\" anhand des Frage-"]
[null,null,"bogens »Einzelfallanalyse – Verstorbene mit primärer oder sekundärer Hirnschädigung« dokumentiert. "]
[null,null,"Zusätzlich lässt sich aus den gefilterten und vollständig dokumentierten Fällen der Datensatz exportieren, den"]
[null,null,"die Entnahmekrankenhäuser gemäß § 9a Abs. 2 Nr. 6 TPG mindestens einmal jährlich bis zum 30.06. an die"]
[null,null,"DSO übermitteln müssen."]
[]
[null,null,"TransplantCheck filtert die Datensätze gemäß § 21 KHEntgG nach den relevanten Todesfällen."]
[null,null,"Es werden folgende Dateien benötigt, die Bestandteil der an das InEK jährlich zu übermittelnden"]
[null,null,"Leistungsdaten sind:"]
[]
[null,null,null,"· FAB.csv"]
[null,null,null,"· FALL.csv"]
[null,null,null,"· ICD.csv"]
[null,null,null,"· OPS.csv"]
[]
[null,null,"Diese Datensätze werden in der Regel von der IT-Abteilung oder dem (Medizin-)Controlling erstellt."]
[]
[null,null,"Es können nur Datensätze eingelesen werden, die der aktuellen Datensatzbeschreibung des InEK entsprechen."]
[null,null,"Diese Datensatzbeschreibung finden Sie auch auf unserer Webseite (siehe Kasten unten)."]
[]
[]
[null,null,"Weitere Voraussetzungen zur Verwendung dieses Tools:"]
{"$rows_left_out":15}
{"sheet":"Todesfälle mit HS","index":1,"n_rows":1,"n_cols":29,"rows_kept":1,"cut":false,"hidden":false,"merged":[]}
["Zuordnung","Status EFA","KH-internes-Kennzeichen","Entlassender Standort","Geschlecht","Alter","Patienten-nummer","Aufnahme-datum KH","Entlassungs-datum KH","Behandlungs-dauer","Beatmungs-dauer","Aufnahme-datum Intensiv","Entlassungs-datum Intensiv","Liegedauer Intensiv","Aufnahme-datum letzte FAB","Liegedauer letzte FAB","FAB","HD","ND","OPS-Kode","KI-Diagnose","KI","Traumatisch","Art Hirnschädigung","EFA-Code","Fehlende Einwilligung","Beteiligung TxB","Fall mit DSO besprochen","Bemerkungen"]

{"sheet":"Zusammenfassung","index":2,"n_rows":46,"n_cols":8,"rows_kept":46,"cut":false,"hidden":false,"merged":[]}
[]
[]
["Übersicht der erfassten Daten"]
[]
[]
[]
[]
[]
[]
[]
[]
[]
[]
[]
[]
[]
[]
[]
[null,null,null,"davon in den Altersgruppen"]
[null,"Gesamt",null,"<16 Jahre","16-54 Jahre","55-64 Jahre","65-74 Jahre",">=75 Jahre"]
[]
["Detektierte Fälle",{"$f":"SUM(D22:H22)","v":0},null,{"$f":"IFERROR(SUMIFS(INDEX(Pivot_Altersstruktur,,MATCH(\"Gesamtergebnis\",INDEX(Pivot_Altersstruktur,1,),0)),INDEX(Pivot_Altersstruktur,,1),\"<16\"),0)","v":0},{"$f":"IFERROR(SUMIFS(INDEX(Pivot_Altersstruktur,,MATCH(\"Gesamtergebnis\",INDEX(Pivot_Altersstruktur,1,),0)),INDEX(Pivot_Altersstruktur,,1),\">=16\",INDEX(Pivot_Altersstruktur,,1),\"<=54\"),0)","v":0},{"$f":"IFERROR(SUMIFS(INDEX(Pivot_Altersstruktur,,MATCH(\"Gesamtergebnis\",INDEX(Pivot_Altersstruktur,1,),0)),INDEX(Pivot_Altersstruktur,,1),\">=55\",INDEX(Pivot_Altersstruktur,,1),\"<=64\"),0)","v":0},{"$f":"IFERROR(SUMIFS(INDEX(Pivot_Altersstruktur,,MATCH(\"Gesamtergebnis\",INDEX(Pivot_Altersstruktur,1,),0)),INDEX(Pivot_Altersstruktur,,1),\">=65\",INDEX(Pivot_Altersstruktur,,1),\"<=74\"),0)","v":0},{"$f":"IFERROR(SUMIFS(INDEX(Pivot_Altersstruktur,,MATCH(\"Gesamtergebnis\",INDEX(Pivot_Altersstruktur,1,),0)),INDEX(Pivot_Altersstruktur,,1),\">=75\"),0)","v":0}]
[]
[]
["Fälle mit absoluter Kontraindikation",{"$f":"IFERROR(GETPIVOTDATA(\"KH-internes-Kennzeichen\",Grundlagen!$L$1,\"Zuordnung\",\"Absolute Kontraindikation\"),0)","v":0},null,{"$f":"IFERROR(SUMIFS(INDEX(Pivot_Altersstruktur,,MATCH(\"Absolute Kontraindikation\",INDEX(Pivot_Altersstruktur,1,),0)),INDEX(Pivot_Altersstruktur,,1),\"<16\"),0)","v":0},{"$f":"IFERROR(SUMIFS(INDEX(Pivot_Altersstruktur,,MATCH(\"Absolute Kontraindikation\",INDEX(Pivot_Altersstruktur,1,),0)),INDEX(Pivot_Altersstruktur,,1),\">=16\",INDEX(Pivot_Altersstruktur,,1),\"<=54\"),0)","v":0},{"$f":"IFERROR(SUMIFS(INDEX(Pivot_Altersstruktur,,MATCH(\"Absolute Kontraindikation\",INDEX(Pivot_Altersstruktur,1,),0)),INDEX(Pivot_Altersstruktur,,1),\">=55\",INDEX(Pivot_Altersstruktur,,1),\"<=64\"),0)","v":0},{"$f":"IFERROR(SUMIFS(INDEX(Pivot_Altersstruktur,,MATCH(\"Absolute Kontraindikation\",INDEX(Pivot_Altersstruktur,1,),0)),INDEX(Pivot_Altersstruktur,,1),\">=65\",INDEX(Pivot_Altersstruktur,,1),\"<=74\"),0)","v":0},{"$f":"IFERROR(SUMIFS(INDEX(Pivot_Altersstruktur,,MATCH(\"Absolute Kontraindikation\",INDEX(Pivot_Altersstruktur,1,),0)),INDEX(Pivot_Altersstruktur,,1),\">=75\"),0)","v":0}]
[]
["Fälle mit 0 Beatmungsstunden",{"$f":"IFERROR(GETPIVOTDATA(\"KH-internes-Kennzeichen\",Grundlagen!$L$1,\"Zuordnung\",\"0-Beatmungsstunden\"),0)","v":0},null,{"$f":"IFERROR(SUMIFS(INDEX(Pivot_Altersstruktur,,MATCH(\"0-Beatmungsstunden\",INDEX(Pivot_Altersstruktur,1,),0)),INDEX(Pivot_Altersstruktur,,1),\"<16\"),0)","v":0},{"$f":"IFERROR(SUMIFS(INDEX(Pivot_Altersstruktur,,MATCH(\"0-Beatmungsstunden\",INDEX(Pivot_Altersstruktur,1,),0)),INDEX(Pivot_Altersstruktur,,1),\">=16\",INDEX(Pivot_Altersstruktur,,1),\"<=54\"),0)","v":0},{"$f":"IFERROR(SUMIFS(INDEX(Pivot_Altersstruktur,,MATCH(\"0-Beatmungsstunden\",INDEX(Pivot_Altersstruktur,1,),0)),INDEX(Pivot_Altersstruktur,,1),\">=55\",INDEX(Pivot_Altersstruktur,,1),\"<=64\"),0)","v":0},{"$f":"IFERROR(SUMIFS(INDEX(Pivot_Altersstruktur,,MATCH(\"0-Beatmungsstunden\",INDEX(Pivot_Altersstruktur,1,),0)),INDEX(Pivot_Altersstruktur,,1),\">=65\",INDEX(Pivot_Altersstruktur,,1),\"<=74\"),0)","v":0},{"$f":"IFERROR(SUMIFS(INDEX(Pivot_Altersstruktur,,MATCH(\"0-Beatmungsstunden\",INDEX(Pivot_Altersstruktur,1,),0)),INDEX(Pivot_Altersstruktur,,1),\">=75\"),0)","v":0}]
[]
["Kontaktaufnahmen DSO (A2-B2)",{"$f":"IFERROR(GETPIVOTDATA(\"KH-internes-Kennzeichen\",Grundlagen!$L$1,\"Zuordnung\",\"Kontaktaufnahme DSO (A2-B2)\"),0)","v":0},null,{"$f":"IFERROR(SUMIFS(INDEX(Pivot_Altersstruktur,,MATCH(\"Kontaktaufnahme DSO (A2-B2)\",INDEX(Pivot_Altersstruktur,1,),0)),INDEX(Pivot_Altersstruktur,,1),\"<16\"),0)","v":0},{"$f":"IFERROR(SUMIFS(INDEX(Pivot_Altersstruktur,,MATCH(\"Kontaktaufnahme DSO (A2-B2)\",INDEX(Pivot_Altersstruktur,1,),0)),INDEX(Pivot_Altersstruktur,,1),\">=16\",INDEX(Pivot_Altersstruktur,,1),\"<=54\"),0)","v":0},{"$f":"IFERROR(SUMIFS(INDEX(Pivot_Altersstruktur,,MATCH(\"Kontaktaufnahme DSO (A2-B2)\",INDEX(Pivot_Altersstruktur,1,),0)),INDEX(Pivot_Altersstruktur,,1),\">=55\",INDEX(Pivot_Altersstruktur,,1),\"<=64\"),0)","v":0},{"$f":"IFERROR(SUMIFS(INDEX(Pivot_Altersstruktur,,MATCH(\"Kontaktaufnahme DSO (A2-B2)\",INDEX(Pivot_Altersstruktur,1,),0)),INDEX(Pivot_Altersstruktur,,1),\">=65\",INDEX(Pivot_Altersstruktur,,1),\"<=74\"),0)","v":0},{"$f":"IFERROR(SUMIFS(INDEX(Pivot_Altersstruktur,,MATCH(\"Kontaktaufnahme DSO (A2-B2)\",INDEX(Pivot_Altersstruktur,1,),0)),INDEX(Pivot_Altersstruktur,,1),\">=75\"),0)","v":0}]
[]
{"$rows_left_out":17}
{"sheet":"Grundlagen","index":3,"n_rows":4,"n_cols":26,"rows_kept":4,"cut":false,"hidden":true,"merged":[]}
["Zuordnung","Status EFA","KH-internes-Kennzeichen","Entlassender Standort","Alter","Entlassungsdatum KH","FAB","Jahr","Monat","Monatsname",null,"Anzahl","Spaltenbeschriftungen",null,null,null,null,null,null,null,null,"Entlassender Standort","Anzahl",null,"Zuordnung","(Alle)"]
[null,null,null,null,null,null,null,{"$f":"IF(tbl_BasisZusammenfassung[[#This Row],[Entlassungsdatum KH]]=\"\",\"\",YEAR(tbl_BasisZusammenfassung[[#This Row],[Entlassungsdatum KH]]))","v":""},{"$f":"IF(tbl_BasisZusammenfassung[[#This Row],[Entlassungsdatum KH]]=\"\",\"\",MONTH(tbl_BasisZusammenfassung[[#This Row],[Entlassungsdatum KH]]))","v":""},{"$f":"IF(tbl_BasisZusammenfassung[[#This Row],[Entlassungsdatum KH]]=\"\",\"\",TEXT(tbl_BasisZusammenfassung[[#This Row],[Entlassungsdatum KH]],\"MMMM\"))","v":""},null,"Alter","(Leer)","Gesamtergebnis",null,null,null,null,null,null,null,"(Leer)"]
[null,null,null,null,null,null,null,{"$f":"IF(tbl_BasisZusammenfassung[[#This Row],[Entlassungsdatum KH]]=\"\",\"\",YEAR(tbl_BasisZusammenfassung[[#This Row],[Entlassungsdatum KH]]))","v":""},{"$f":"IF(tbl_BasisZusammenfassung[[#This Row],[Entlassungsdatum KH]]=\"\",\"\",MONTH(tbl_BasisZusammenfassung[[#This Row],[Entlassungsdatum KH]]))","v":""},{"$f":"IF(tbl_BasisZusammenfassung[[#This Row],[Entlassungsdatum KH]]=\"\",\"\",TEXT(tbl_BasisZusammenfassung[[#This Row],[Entlassungsdatum KH]],\"MMMM\"))","v":""},null,"(Leer)",null,null,null,null,null,null,null,null,null,null,null,null,"Status EFA","Anzahl"]
[null,null,null,null,null,null,null,null,null,null,null,"Gesamtergebnis",null,null,null,null,null,null,null,null,null,null,null,null,"(Leer)"]

{"sheet":"ICD-Filter","index":4,"n_rows":344,"n_cols":3,"rows_kept":344,"cut":false,"hidden":true,"merged":[]}
["ICD-Filter","Beschreibung","Gruppe"]
["C70.0","Bösartige Neubildung: Hirnhäute","Bösartige Neubildung der Meningen"]
["C70.0+","Bösartige Neubildung: Hirnhäute","Bösartige Neubildung der Meningen"]
["C70.9","Bösartige Neubildung: Meningen, nicht näher bezeichnet","Bösartige Neubildung der Meningen"]
["C70.9+","Bösartige Neubildung: Meningen, nicht näher bezeichnet","Bösartige Neubildung der Meningen"]
["C71.0","Bösartige Neubildung: Zerebrum, ausgenommen Hirnlappen und Ventrikel","Bösartige Neubildung des Gehirns"]
["C71.0+","Bösartige Neubildung: Zerebrum, ausgenommen Hirnlappen und Ventrikel","Bösartige Neubildung des Gehirns"]
["C71.1","Bösartige Neubildung: Frontallappen","Bösartige Neubildung des Gehirns"]
["C71.1+","Bösartige Neubildung: Frontallappen","Bösartige Neubildung des Gehirns"]
["C71.2","Bösartige Neubildung: Temporallappen","Bösartige Neubildung des Gehirns"]
["C71.2+","Bösartige Neubildung: Temporallappen","Bösartige Neubildung des Gehirns"]
["C71.3","Bösartige Neubildung: Parietallappen","Bösartige Neubildung des Gehirns"]
["C71.3+","Bösartige Neubildung: Parietallappen","Bösartige Neubildung des Gehirns"]
["C71.4","Bösartige Neubildung: Okzipitallappen","Bösartige Neubildung des Gehirns"]
["C71.4+","Bösartige Neubildung: Okzipitallappen","Bösartige Neubildung des Gehirns"]
["C71.5","Bösartige Neubildung: Hirnventrikel","Bösartige Neubildung des Gehirns"]
["C71.5+","Bösartige Neubildung: Hirnventrikel","Bösartige Neubildung des Gehirns"]
["C71.6","Bösartige Neubildung: Zerebellum","Bösartige Neubildung des Gehirns"]
["C71.6+","Bösartige Neubildung: Zerebellum","Bösartige Neubildung des Gehirns"]
["C71.7","Bösartige Neubildung: Hirnstamm","Bösartige Neubildung des Gehirns"]
["C71.7+","Bösartige Neubildung: Hirnstamm","Bösartige Neubildung des Gehirns"]
["C71.8","Bösartige Neubildung: Gehirn, mehrere Teilbereiche überlappend","Bösartige Neubildung des Gehirns"]
["C71.8+","Bösartige Neubildung: Gehirn, mehrere Teilbereiche überlappend","Bösartige Neubildung des Gehirns"]
["C71.9","Bösartige Neubildung: Gehirn, nicht näher bezeichnet","Bösartige Neubildung des Gehirns"]
["C71.9+","Bösartige Neubildung: Gehirn, nicht näher bezeichnet","Bösartige Neubildung des Gehirns"]
["D32.0","Gutartige Neubildung: Hirnhäute","Gutartige Neubildung der Meningen"]
["D32.0+","Gutartige Neubildung: Hirnhäute","Gutartige Neubildung der Meningen"]
["D32.9","Gutartige Neubildung: Meningen, nicht näher bezeichnet","Gutartige Neubildung der Meningen"]
["D32.9+","Gutartige Neubildung: Meningen, nicht näher bezeichnet","Gutartige Neubildung der Meningen"]
["D33.0","Gutartige Neubildung: Gehirn, supratentoriell","Gutartige Neubildung des Gehirns und anderer Teile des Zentralnervensystems"]
{"$rows_left_out":315}
{"sheet":"KI-Filter","index":5,"n_rows":1002,"n_cols":3,"rows_kept":1002,"cut":false,"hidden":true,"merged":[]}
["KI-Filter","KI-Art","Beschreibung"]
["A15","absolut","Tuberkulose der Atmungsorgane, bakteriologisch, molekularbiologisch oder histologisch gesichert"]
["A15.0","absolut","Lungentuberkulose, durch mikroskopische Untersuchung des Sputums gesichert, mit oder ohne Nachweis durch Kultur oder molekularbiologische Verfahren"]
["A15.1","absolut","Lungentuberkulose, nur durch Kultur gesichert"]
["A15.2","absolut","Lungentuberkulose, histologisch gesichert"]
["A15.3","absolut","Lungentuberkulose, durch sonstige und nicht näher bezeichnete Untersuchungsverfahren gesichert"]
["A15.4","absolut","Tuberkulose der intrathorakalen Lymphknoten, bakteriologisch, molekularbiologisch oder histologisch gesichert"]
["A15.5","absolut","Tuberkulose des Larynx, der Trachea und der Bronchien, bakteriologisch, molekularbiologisch oder histologisch gesichert"]
["A15.6","absolut","Tuberkulöse Pleuritis, bakteriologisch, molekularbiologisch oder histologisch gesichert"]
["A15.7","absolut","Primäre Tuberkulose der Atmungsorgane, bakteriologisch, molekularbiologisch oder histologisch gesichert"]
["A15.8","absolut","Sonstige Tuberkulose der Atmungsorgane, bakteriologisch, molekularbiologisch oder histologisch gesichert"]
["A15.9","absolut","Nicht näher bezeichnete Tuberkulose der Atmungsorgane, bakteriologisch, molekularbiologisch oder histologisch gesichert"]
["A16","absolut","Tuberkulose der Atmungsorgane, weder bakteriologisch, molekularbiologisch noch histologisch gesichert"]
["A16.0","absolut","Lungentuberkulose, weder bakteriologisch, molekularbiologisch noch histologisch gesichert"]
["A16.1","absolut","Lungentuberkulose, bakteriologische, molekularbiologische und histologische Untersuchung nicht durchgeführt"]
["A16.2","absolut","Lungentuberkulose ohne Angabe einer bakteriologischen, molekularbiologischen oder histologischen Sicherung"]
["A16.3","absolut","Tuberkulose der intrathorakalen Lymphknoten ohne Angabe einer bakteriologischen, molekularbiologischen oder histologischen Sicherung"]
["A16.4","absolut","Tuberkulose des Larynx, der Trachea und der Bronchien ohne Angabe einer bakteriologischen, molekularbiologischen oder histologischen Sicherung"]
["A16.5","absolut","Tuberkulöse Pleuritis ohne Angabe einer bakteriologischen, molekularbiologischen oder histologischen Sicherung"]
["A16.7","absolut","Primäre Tuberkulose der Atmungsorgane ohne Angabe einer bakteriologischen, molekularbiologischen oder histologischen Sicherung"]
["A16.8","absolut","Sonstige Tuberkulose der Atmungsorgane ohne Angabe einer bakteriologischen, molekularbiologischen oder histologischen Sicherung"]
["A16.9","absolut","Nicht näher bezeichnete Tuberkulose der Atmungsorgane ohne Angabe einer bakteriologischen, molekularbiologischen oder histologischen Sicherung"]
["A17","absolut","Tuberkulose des Nervensystems"]
["A17.0","absolut","Tuberkulöse Meningitis"]
["A17.1","absolut","Meningeales Tuberkulom"]
["A17.8","absolut","Sonstige Tuberkulose des Nervensystems"]
["A17.9","absolut","Tuberkulose des Nervensystems, nicht näher bezeichnet"]
["A18","absolut","Tuberkulose sonstiger Organe"]
["A18.0","absolut","Tuberkulose der Knochen und Gelenke"]
["A18.1","absolut","Tuberkulose des Urogenitalsystems"]
{"$rows_left_out":973}
{"sheet":"FAB-Liste","index":6,"n_rows":39,"n_cols":2,"rows_kept":39,"cut":false,"hidden":true,"merged":[]}
["FAB","FAB-Bezeichnung"]
["0100","Innere Medizin"]
["0200","Geriatrie"]
["0300","Kardiologie"]
["0400","Nephrologie"]
["0500","Hämatologie und internistische Onkologie"]
["0600","Endokrinologie"]
["0700","Gastroenterologie"]
["0800","Pneumologie"]
["0900","Rheumatologie"]
[1000,"Pädiatrie"]
[1100,"Kinderkardiologie"]
[1200,"Neonatologie"]
[1300,"Kinderchirurgie"]
[1400,"Lungen- und Bronchialheilkunde"]
[1500,"Allgemeine Chirurgie"]
[1600,"Unfallchirurgie"]
[1700,"Neurochirurgie"]
[1800,"Gefäßchirurgie"]
[1900,"Plastische Chirurgie"]
[2000,"Thoraxchirurgie"]
[2100,"Herzchirurgie"]
[2200,"Urologie"]
[2300,"Orthopädie"]
[2400,"Frauenheilkunde und Geburtshilfe"]
[2500,"davon Geburtshilfe"]
[2600,"Hals-, Nasen-, Ohrenheilkunde"]
[2700,"Augenheilkunde"]
[2800,"Neurologie"]
[2900,"Allgemeine Psychiatrie"]
{"$rows_left_out":10}
{"sheet":"EFA-Codes","index":7,"n_rows":59,"n_cols":2,"rows_kept":59,"cut":false,"hidden":true,"merged":[]}
[]
[]
["Kategorien"]
["Absolute Kontraindikation"]
["0-Beatmungsstunden"]
["Kontaktaufnahme DSO (A2-B2)"]
["Organspender (B3)"]
["Einzelfallanalyse"]
[]
[]
[]
[]
[]
[]
["Keine Einleitung IHA"]
["Antworten","Schlüssel"]
[]
["Widerspruch zur Organspende war bekannt","1KEW"]
["Vorliegen einer medizinischen Kontraindikation zur Organspende","1MKI"]
["Herz-Kreislaufstillstand","1HKS"]
["Keine Hirnstammareflexie / erhaltener Atemantrieb","1KHA"]
["Vorliegen einer Patientenverfügung erlaubte keine Fortsetzung der Therapie","1VPV"]
["Therapielimitierung bei infauster Prognose mit Angehörigen besprochen, ohne Besprechung der Option einer Organspende","1TLO"]
["Einleitung IHA-Diagnostik wäre indiziert gewesen, erfolgte aber nicht","1KID"]
[]
["IHA eingeleitet, aber nicht abgeschlossen"]
["Antworten","Schlüssel"]
[]
["Irreversibler Hirnfunktionsausfall nicht feststellbar","2INF"]
["Widerspruch zur Organspende wurde bekannt","2KEW"]
{"$rows_left_out":30}
{"sheet":"DS_Beschreibung","index":8,"n_rows":13,"n_cols":13,"rows_kept":13,"cut":false,"hidden":true,"merged":[]}
[null,null,null,"FAB.csv: Datensatzbeschreibung gem. §21 KHEntgG im Vergleich mit eingelesener Datei"]
[]
[null,null,"Feldbezeichner gem. §21 KHEntgG (Version 2021)",null,"Vorhanden",null,">>> FAB.csv"]
[null,null,"Spalte2","Feld","Vorhanden","Spalte1","Spalte3","ImportDS"]
[null,null,{"$f":"IF(tbl_VergleichDS[[#This Row],[Feld]]=\"\",\"\",ROW(tbl_VergleichDS[[#This Row],[Feld]])-4)","v":1},"IK",{"$f":"IF(tbl_VergleichDS[[#This Row],[Feld]]=\"\",\"\",IF(ISERROR(MATCH(tbl_VergleichDS[[#This Row],[Feld]],tbl_VergleichDS[[#All],[ImportDS]],0)),-1,IF(tbl_VergleichDS[[#This Row],[Feld]]<>tbl_VergleichDS[[#This Row],[ImportDS]],0,1)))","v":1},null,{"$f":"IF(tbl_VergleichDS[[#This Row],[ImportDS]]=\"\",\"\",ROW(tbl_VergleichDS[[#This Row],[ImportDS]])-4)","v":1},"IK",null,null,null,"Datei","Feldbezeichner"]
[null,null,{"$f":"IF(tbl_VergleichDS[[#This Row],[Feld]]=\"\",\"\",ROW(tbl_VergleichDS[[#This Row],[Feld]])-4)","v":2},"Entlassender-Standort",{"$f":"IF(tbl_VergleichDS[[#This Row],[Feld]]=\"\",\"\",IF(ISERROR(MATCH(tbl_VergleichDS[[#This Row],[Feld]],tbl_VergleichDS[[#All],[ImportDS]],0)),-1,IF(tbl_VergleichDS[[#This Row],[Feld]]<>tbl_VergleichDS[[#This Row],[ImportDS]],0,1)))","v":1},null,{"$f":"IF(tbl_VergleichDS[[#This Row],[ImportDS]]=\"\",\"\",ROW(tbl_VergleichDS[[#This Row],[ImportDS]])-4)","v":2},"Entlassender-Standort",null,null,null,"FAB","IK;Entlassender-Standort;Entgeltbereich;KH-internes-Kennzeichen; Standortnummer-Behandlungsort;Fachabteilung;FAB-Aufnahmedatum;FAB-Entlassungsdatum;KennungIntensivbett"]
[null,null,{"$f":"IF(tbl_VergleichDS[[#This Row],[Feld]]=\"\",\"\",ROW(tbl_VergleichDS[[#This Row],[Feld]])-4)","v":3},"Entgeltbereich",{"$f":"IF(tbl_VergleichDS[[#This Row],[Feld]]=\"\",\"\",IF(ISERROR(MATCH(tbl_VergleichDS[[#This Row],[Feld]],tbl_VergleichDS[[#All],[ImportDS]],0)),-1,IF(tbl_VergleichDS[[#This Row],[Feld]]<>tbl_VergleichDS[[#This Row],[ImportDS]],0,1)))","v":1},null,{"$f":"IF(tbl_VergleichDS[[#This Row],[ImportDS]]=\"\",\"\",ROW(tbl_VergleichDS[[#This Row],[ImportDS]])-4)","v":3},"Entgeltbereich",null,null,null,"FALL","IK;Entlassender-Standort;Entgeltbereich;KH-internes-Kennzeichen;Versicherten-ID;Vertragskennzeichen-64b-Modellvorhaben;IK-der-Krankenkasse; Geburtsjahr;Geburtsmonat;Geschlecht;PLZ;Wohnort; Aufnahmedatum; Aufnahmeanlass;Aufnahmegrund; Fallzusammenführung;Fallzusammenführungsgrund; Aufnahmegewicht; Entlassungsdatum;Entlassungsgrund; Alter-in-Tagen-am-Aufnahmetag;Alter-in-Jahren-am-Aufnahmetag; Patientennummer;Interkurrente-Dialysen;Beatmungsstunden; Behandlungsbeginn-vorstationär; Behandlungstage-vorstationär; Behandlungsende-nachstationär;Behandlungstage-nachstationär; IK-Verlegungs-KH;Belegungstage-in-anderem-Entgeltbereich;Beurlaubungstage-PSY;Kennung-Besonderer-Fall-Modellvorhaben;Verweildauer-Intensiv"]
[null,null,{"$f":"IF(tbl_VergleichDS[[#This Row],[Feld]]=\"\",\"\",ROW(tbl_VergleichDS[[#This Row],[Feld]])-4)","v":4},"KH-internes-Kennzeichen",{"$f":"IF(tbl_VergleichDS[[#This Row],[Feld]]=\"\",\"\",IF(ISERROR(MATCH(tbl_VergleichDS[[#This Row],[Feld]],tbl_VergleichDS[[#All],[ImportDS]],0)),-1,IF(tbl_VergleichDS[[#This Row],[Feld]]<>tbl_VergleichDS[[#This Row],[ImportDS]],0,1)))","v":1},null,{"$f":"IF(tbl_VergleichDS[[#This Row],[ImportDS]]=\"\",\"\",ROW(tbl_VergleichDS[[#This Row],[ImportDS]])-4)","v":4},"KH-internes-Kennzeichen",null,null,null,"ICD","IK;Entlassender-Standort;Entgeltbereich;KH-internes-Kennzeichen; Diagnoseart;ICD-Version;ICD-Kode;Lokalisation;Diagnosensicherheit; Sekundär-Kode;Lokalisation;Diagnosensicherheit"]
[null,null,{"$f":"IF(tbl_VergleichDS[[#This Row],[Feld]]=\"\",\"\",ROW(tbl_VergleichDS[[#This Row],[Feld]])-4)","v":5},"Standortnummer-Behandlungsort",{"$f":"IF(tbl_VergleichDS[[#This Row],[Feld]]=\"\",\"\",IF(ISERROR(MATCH(tbl_VergleichDS[[#This Row],[Feld]],tbl_VergleichDS[[#All],[ImportDS]],0)),-1,IF(tbl_VergleichDS[[#This Row],[Feld]]<>tbl_VergleichDS[[#This Row],[ImportDS]],0,1)))","v":1},null,{"$f":"IF(tbl_VergleichDS[[#This Row],[ImportDS]]=\"\",\"\",ROW(tbl_VergleichDS[[#This Row],[ImportDS]])-4)","v":5},"Standortnummer-Behandlungsort",null,null,null,"OPS","IK;Entlassender-Standort;Entgeltbereich;KH-internes-Kennzeichen; OPS-Version;OPS-Kode;Lokalisation;OPS-Datum;Belegoperateur;Beleganästhesist;Beleghebamme"]
[null,null,{"$f":"IF(tbl_VergleichDS[[#This Row],[Feld]]=\"\",\"\",ROW(tbl_VergleichDS[[#This Row],[Feld]])-4)","v":6},"Fachabteilung",{"$f":"IF(tbl_VergleichDS[[#This Row],[Feld]]=\"\",\"\",IF(ISERROR(MATCH(tbl_VergleichDS[[#This Row],[Feld]],tbl_VergleichDS[[#All],[ImportDS]],0)),-1,IF(tbl_VergleichDS[[#This Row],[Feld]]<>tbl_VergleichDS[[#This Row],[ImportDS]],0,1)))","v":1},null,{"$f":"IF(tbl_VergleichDS[[#This Row],[ImportDS]]=\"\",\"\",ROW(tbl_VergleichDS[[#This Row],[ImportDS]])-4)","v":6},"Fachabteilung",null,null,null,"FAB_Namen","FAB;FAB-Bezeichnung"]
[null,null,{"$f":"IF(tbl_VergleichDS[[#This Row],[Feld]]=\"\",\"\",ROW(tbl_VergleichDS[[#This Row],[Feld]])-4)","v":7},"FAB-Aufnahmedatum",{"$f":"IF(tbl_VergleichDS[[#This Row],[Feld]]=\"\",\"\",IF(ISERROR(MATCH(tbl_VergleichDS[[#This Row],[Feld]],tbl_VergleichDS[[#All],[ImportDS]],0)),-1,IF(tbl_VergleichDS[[#This Row],[Feld]]<>tbl_VergleichDS[[#This Row],[ImportDS]],0,1)))","v":1},null,{"$f":"IF(tbl_VergleichDS[[#This Row],[ImportDS]]=\"\",\"\",ROW(tbl_VergleichDS[[#This Row],[ImportDS]])-4)","v":7},"FAB-Aufnahmedatum",null,null,null,"bak_icd","ICD-Filter;Beschreibung;Gruppe"]
[null,null,{"$f":"IF(tbl_VergleichDS[[#This Row],[Feld]]=\"\",\"\",ROW(tbl_VergleichDS[[#This Row],[Feld]])-4)","v":8},"FAB-Entlassungsdatum",{"$f":"IF(tbl_VergleichDS[[#This Row],[Feld]]=\"\",\"\",IF(ISERROR(MATCH(tbl_VergleichDS[[#This Row],[Feld]],tbl_VergleichDS[[#All],[ImportDS]],0)),-1,IF(tbl_VergleichDS[[#This Row],[Feld]]<>tbl_VergleichDS[[#This Row],[ImportDS]],0,1)))","v":1},null,{"$f":"IF(tbl_VergleichDS[[#This Row],[ImportDS]]=\"\",\"\",ROW(tbl_VergleichDS[[#This Row],[ImportDS]])-4)","v":8},"FAB-Entlassungsdatum",null,null,null,"bak_ki","KI-Filter;KI-Art"]
[null,null,{"$f":"IF(tbl_VergleichDS[[#This Row],[Feld]]=\"\",\"\",ROW(tbl_VergleichDS[[#This Row],[Feld]])-4)","v":9},"KennungIntensivbett",{"$f":"IF(tbl_VergleichDS[[#This Row],[Feld]]=\"\",\"\",IF(ISERROR(MATCH(tbl_VergleichDS[[#This Row],[Feld]],tbl_VergleichDS[[#All],[ImportDS]],0)),-1,IF(tbl_VergleichDS[[#This Row],[Feld]]<>tbl_VergleichDS[[#This Row],[ImportDS]],0,1)))","v":-1},null,{"$f":"IF(tbl_VergleichDS[[#This Row],[ImportDS]]=\"\",\"\",ROW(tbl_VergleichDS[[#This Row],[ImportDS]])-4)","v":9},"Kennung-Intensivbett"]